BDBM50137796 ((S)-1-Formyl-2-methyl-butyl)-carbamic acid tert-butyl ester::CHEMBL330046
SMILES CCC(C)[C@H](NC(=O)OC(C)(C)C)C=O
InChI Key InChIKey=YJAAJMSZVZJPOQ-YGPZHTELSA-N
Data  1 IC50
  Tab Delimited (TSV)   2D SDfile   Computed 3D by Vconf -m prep SDfile
Find this compound or compounds like it in BindingDB:
Activity Spreadsheet -- Enzyme Inhibition Constant Data from BindingDB
Found 1 hit for monomerid = 50137796
TargetCathepsin K(Homo sapiens (Human))
Glaxosmithkline
Curated by ChEMBL
LigandPNGBDBM50137796(((S)-1-Formyl-2-methyl-butyl)-carbamic acid tert-b...)
Affinity DataIC50:  250nM. Assay description: Inhibiory activity against recombinant human cathepsin K
In DepthDetails ArticlePubMed