BDBM50137809 ((S)-1-Formyl-3-methyl-but-3-enyl)-carbamic acid tert-butyl ester::CHEMBL96482
SMILES CC(=C)C[C@H](NC(=O)OC(C)(C)C)C=O
InChI Key InChIKey=RVOIREFTVREURB-VIFPVBQESA-N
Data  1 IC50
  Tab Delimited (TSV)   2D SDfile   Computed 3D by Vconf -m prep SDfile
Find this compound or compounds like it in BindingDB:
Activity Spreadsheet -- Enzyme Inhibition Constant Data from BindingDB
Found 1 hit for monomerid = 50137809
TargetCathepsin K(Homo sapiens (Human))
Glaxosmithkline
Curated by ChEMBL
LigandPNGBDBM50137809(((S)-1-Formyl-3-methyl-but-3-enyl)-carbamic acid t...)
Affinity DataIC50:  79nM. Assay description: Inhibiory activity against recombinant human cathepsin K
In DepthDetails ArticlePubMed