BDBM50137810 ((S)-1-Formyl-3-phenyl-propyl)-carbamic acid tert-butyl ester::CHEMBL92025
SMILES CC(C)(C)OC(=O)N[C@@H](CCc1ccccc1)C=O
InChI Key InChIKey=JMHGMBRMIWBUPG-ZDUSSCGKSA-N
Data  1 IC50
  Tab Delimited (TSV)   2D SDfile   Computed 3D by Vconf -m prep SDfile
Find this compound or compounds like it in BindingDB:
Activity Spreadsheet -- Enzyme Inhibition Constant Data from BindingDB
Found 1 hit for monomerid = 50137810
TargetCathepsin K(Homo sapiens (Human))
Glaxosmithkline
Curated by ChEMBL
LigandPNGBDBM50137810(((S)-1-Formyl-3-phenyl-propyl)-carbamic acid tert-...)
Affinity DataIC50:  30nM. Assay description: Inhibiory activity against recombinant human cathepsin K
In DepthDetails ArticlePubMed