BDBM50137816 ((S)-1-Cyclohexyl-2-oxo-ethyl)-carbamic acid tert-butyl ester::CHEMBL92567::TERT-BUTYL(1S)-1-CYCLOHEXYL-2-OXOETHYLCARBAMATE
SMILES CC(C)(C)OC(=O)N[C@H](C=O)C1CCCCC1
InChI Key InChIKey=BDSGOSWEKUGHOV-LLVKDONJSA-N
Data  2 IC50
PDB links: 1 PDB ID matches this monomer.
  Tab Delimited (TSV)   2D SDfile   Computed 3D by Vconf -m prep SDfile
Find this compound or compounds like it in BindingDB:
Activity Spreadsheet -- Enzyme Inhibition Constant Data from BindingDB
Found 1 hit for monomerid = 50137816
TargetCathepsin K(Homo sapiens (Human))
Glaxosmithkline
Curated by ChEMBL
LigandPNGBDBM50137816(((S)-1-Cyclohexyl-2-oxo-ethyl)-carbamic acid tert-...)
Affinity DataIC50:  26nM. Assay description: Inhibiory activity against recombinant human cathepsin K