BDBM50137818 ((S)-1-Formyl-2-phenyl-ethyl)-carbamic acid tert-butyl ester::CHEMBL94327
SMILES CC(C)(C)OC(=O)N[C@@H](Cc1ccccc1)C=O
InChI Key InChIKey=ZJTYRNPLVNMVPQ-LBPRGKRZSA-N
Data  1 IC50
  Tab Delimited (TSV)   2D SDfile   Computed 3D by Vconf -m prep SDfile
Find this compound or compounds like it in BindingDB:
Activity Spreadsheet -- Enzyme Inhibition Constant Data from BindingDB
Found 1 hit for monomerid = 50137818
TargetCathepsin K(Homo sapiens (Human))
Glaxosmithkline
Curated by ChEMBL
LigandPNGBDBM50137818(((S)-1-Formyl-2-phenyl-ethyl)-carbamic acid tert-b...)
Affinity DataIC50:  110nM. Assay description: Inhibiory activity against recombinant human cathepsin K
In DepthDetails ArticlePubMed