BDBM50137823 ((S)-1-Formyl-3,3-dimethyl-butyl)-carbamic acid tert-butyl ester::CHEMBL94150
SMILES CC(C)(C)C[C@H](NC(=O)OC(C)(C)C)C=O
InChI Key InChIKey=BABQUZZMJCHKKX-VIFPVBQESA-N
Data  1 IC50
  Tab Delimited (TSV)   2D SDfile   Computed 3D by Vconf -m prep SDfile
Find this compound or compounds like it in BindingDB:
Activity Spreadsheet -- Enzyme Inhibition Constant Data from BindingDB
Found 1 hit for monomerid = 50137823
TargetCathepsin K(Homo sapiens (Human))
Glaxosmithkline
Curated by ChEMBL
LigandPNGBDBM50137823(((S)-1-Formyl-3,3-dimethyl-butyl)-carbamic acid te...)
Affinity DataIC50:  250nM. Assay description: Inhibiory activity against recombinant human cathepsin K
In DepthDetails ArticlePubMed