BDBM50138008 3-Amino-10-keto-N-cyclobutylmethylmorphinan::CHEMBL300877
SMILES Nc1ccc2C(=O)[C@@H]3[C@@H]4CCCC[C@]4(CCN3CC3CCC3)c2c1
InChI Key InChIKey=RWOONUDEZVLRNB-HFSMHLIXSA-N
Data  3 KI
  Tab Delimited (TSV)   2D SDfile   Computed 3D by Vconf -m prep SDfile
Find this compound or compounds like it in BindingDB:
Activity Spreadsheet -- Enzyme Inhibition Constant Data from BindingDB
Found 3 hits for monomerid = 50138008
TargetKappa-type opioid receptor(Cavia porcellus (domestic guinea pig))
Harvard Medical School
Curated by ChEMBL
LigandPNGBDBM50138008(3-Amino-10-keto-N-cyclobutylmethylmorphinan | CHEM...)
Affinity DataKi:  4.70nM. Assay description: Binding affinity against opioid receptor kappa 1 using [3H]-U-69,593 as radioligand in guinea pig brain membranes.
In DepthDetails ArticlePubMed
TargetMu-type opioid receptor(GUINEA PIG)
Harvard Medical School
Curated by ChEMBL
LigandPNGBDBM50138008(3-Amino-10-keto-N-cyclobutylmethylmorphinan | CHEM...)
Affinity DataKi:  23nM. Assay description: Binding affinity against opioid receptor mu 1 using [3H]-DAMGO as radioligand in guinea pig brain membranes.
In DepthDetails ArticlePubMed
TargetDelta-type opioid receptor(Homo sapiens (Human))
Harvard Medical School
Curated by ChEMBL
LigandPNGBDBM50138008(3-Amino-10-keto-N-cyclobutylmethylmorphinan | CHEM...)
Affinity DataKi:  600nM. Assay description: Binding affinity against opioid receptor delta 1 using [3H]-naltrindole as radioligand in guinea pig brain membranes.
In DepthDetails ArticlePubMed