BDBM50138856 CHEMBL156373::{2-Oxo-2-[(thiophen-2-ylmethyl)-carbamoyl]-ethyl}-carbamic acid 1-isopropyl-2-methyl-propyl ester
SMILES CC(C)C(OC(=O)NCC(=O)C(=O)NCc1cccs1)C(C)C
InChI Key InChIKey=ABQJZYDEFXTFBB-UHFFFAOYSA-N
Data  1 IC50
  Tab Delimited (TSV)   2D SDfile   Computed 3D by Vconf -m prep SDfile
Find this compound or compounds like it in BindingDB:
Activity Spreadsheet -- Enzyme Inhibition Constant Data from BindingDB
Found 1 hit for monomerid = 50138856
TargetCathepsin K(Homo sapiens (Human))
Glaxosmithkline
Curated by ChEMBL
LigandPNGBDBM50138856(CHEMBL156373 | {2-Oxo-2-[(thiophen-2-ylmethyl)-car...)
Affinity DataIC50:  1.20E+4nM. Assay description: Concentration required to inhibit 50% of cysteine protease cathepsin K of human
In DepthDetails ArticlePubMed