BDBM50140190 CHEMBL3752825
SMILES Cn1cnc(c1)-c1ccc(OC(F)(F)F)c(NC(=O)Nc2ccncc2)c1
InChI Key InChIKey=AUHSSWFYYYDTKY-UHFFFAOYSA-N
Data  3 IC50
  Tab Delimited (TSV)   2D SDfile   Computed 3D by Vconf -m prep SDfile
Find this compound or compounds like it in BindingDB:
Activity Spreadsheet -- Enzyme Inhibition Constant Data from BindingDB
Found 3 hits for monomerid = 50140190
TargetVascular endothelial growth factor receptor 2(Homo sapiens (Human))
The First Affiliated Hospital Of Xi'An Jiaotong University
Curated by ChEMBL
LigandPNGBDBM50140190(CHEMBL3752825)
Affinity DataIC50:  355nM. Assay description: Inhibition of KDR (unknown origin) incubated for 1 hr assessed as luminescence changes using ATP by ADP-Glo Kinase assay
In DepthDetails ArticlePubMed
TargetFibroblast growth factor receptor 1(Homo sapiens (Human))
The First Affiliated Hospital Of Xi'An Jiaotong University
Curated by ChEMBL
LigandPNGBDBM50140190(CHEMBL3752825)
Affinity DataIC50:  371nM. Assay description: Inhibition of FGFR1 (unknown origin) incubated for 1 hr assessed as luminescence changes using ATP by ADP-Glo Kinase assay
In DepthDetails ArticlePubMed
TargetEpidermal growth factor receptor(Homo sapiens (Human))
The First Affiliated Hospital Of Xi'An Jiaotong University
Curated by ChEMBL
LigandPNGBDBM50140190(CHEMBL3752825)
Affinity DataIC50:  95nM. Assay description: Inhibition of EGFR (unknown origin) incubated for 1 hr assessed as luminescence changes using ATP by ADP-Glo Kinase assay
In DepthDetails ArticlePubMed