BDBM50140326 5-{3-[4-(4-Fluoro-benzyl)-2,6-dimethyl-piperidin-1-yl]-prop-1-ynyl}-1,3-dihydro-benzoimidazol-2-one::CHEMBL19769
SMILES CC1CC(Cc2ccc(F)cc2)CC(C)N1CC#Cc1ccc2[nH]c(=O)[nH]c2c1
InChI Key InChIKey=WFBYLXILHXZFDH-UHFFFAOYSA-N
Data  1 IC50
  Tab Delimited (TSV)   2D SDfile   Computed 3D by Vconf -m prep SDfile
Find this compound or compounds like it in BindingDB:
Activity Spreadsheet -- Enzyme Inhibition Constant Data from BindingDB
Found 1 hit for monomerid = 50140326
TargetGlutamate receptor ionotropic, NMDA 1/2B(Rattus norvegicus (Rat))
Pfizer
Curated by ChEMBL
LigandPNGBDBM50140326(5-{3-[4-(4-Fluoro-benzyl)-2,6-dimethyl-piperidin-1...)
Affinity DataIC50:  157nM. Assay description: Binding affinity against NR1A/2B receptor in rat brains by [3H]-ifenprodil displacement.
In DepthDetails ArticlePubMed