BDBM50140327 6-{3-[4-(4-Fluoro-benzyl)-piperidin-1-yl]-prop-1-ynyl}-4-methyl-1,3-dihydro-benzoimidazol-2-one::CHEMBL19349
SMILES Cc1cc(cc2[nH]c(=O)[nH]c12)C#CCN1CCC(Cc2ccc(F)cc2)CC1
InChI Key InChIKey=AOXMYZGDBKNFQJ-UHFFFAOYSA-N
Data  1 IC50
  Tab Delimited (TSV)   2D SDfile   Computed 3D by Vconf -m prep SDfile
Find this compound or compounds like it in BindingDB:
Activity Spreadsheet -- Enzyme Inhibition Constant Data from BindingDB
Found 1 hit for monomerid = 50140327
TargetGlutamate receptor ionotropic, NMDA 1/2B(Rattus norvegicus (Rat))
Pfizer
Curated by ChEMBL
LigandPNGBDBM50140327(6-{3-[4-(4-Fluoro-benzyl)-piperidin-1-yl]-prop-1-y...)
Affinity DataIC50:  20nM. Assay description: Binding affinity against NR1A/2B receptor in rat brains by [3H]-ifenprodil displacement.
In DepthDetails ArticlePubMed