BDBM50140329 5-(3-{4-[2-(4-Fluoro-phenyl)-ethyl]-piperidin-1-yl}-prop-1-ynyl)-1,3-dihydro-benzoimidazol-2-one::CHEMBL19945
SMILES Fc1ccc(CCC2CCN(CC#Cc3ccc4[nH]c(=O)[nH]c4c3)CC2)cc1
InChI Key InChIKey=CELVXYVYDLKIDH-UHFFFAOYSA-N
Data  1 IC50
  Tab Delimited (TSV)   2D SDfile   Computed 3D by Vconf -m prep SDfile
Find this compound or compounds like it in BindingDB:
Activity Spreadsheet -- Enzyme Inhibition Constant Data from BindingDB
Found 1 hit for monomerid = 50140329
TargetGlutamate receptor ionotropic, NMDA 1/2B(Rattus norvegicus (Rat))
Pfizer
Curated by ChEMBL
LigandPNGBDBM50140329(5-(3-{4-[2-(4-Fluoro-phenyl)-ethyl]-piperidin-1-yl...)
Affinity DataIC50:  481nM. Assay description: Binding affinity against NR1A/2B receptor in rat brains by [3H]-ifenprodil displacement.
In DepthDetails ArticlePubMed