BDBM50140333 5-{3-[4-(4-Fluoro-benzyl)-piperidin-1-yl]-prop-1-ynyl}-6-methoxy-1,3-dihydro-benzoimidazol-2-one::CHEMBL19404
SMILES COc1cc2[nH]c(=O)[nH]c2cc1C#CCN1CCC(Cc2ccc(F)cc2)CC1
InChI Key InChIKey=KMRDOZYIDUQFKP-UHFFFAOYSA-N
Data  1 IC50
  Tab Delimited (TSV)   2D SDfile   Computed 3D by Vconf -m prep SDfile
Find this compound or compounds like it in BindingDB:
Activity Spreadsheet -- Enzyme Inhibition Constant Data from BindingDB
Found 1 hit for monomerid = 50140333
TargetGlutamate receptor ionotropic, NMDA 1/2B(Rattus norvegicus (Rat))
Pfizer
Curated by ChEMBL
LigandPNGBDBM50140333(5-{3-[4-(4-Fluoro-benzyl)-piperidin-1-yl]-prop-1-y...)
Affinity DataIC50:  9nM. Assay description: Binding affinity against NR1A/2B receptor in rat brains by [3H]-ifenprodil displacement.
In DepthDetails ArticlePubMed