BDBM50140335 6-{3-[4-(4-Fluoro-benzyl)-4-hydroxy-piperidin-1-yl]-prop-1-ynyl}-3H-benzothiazol-2-one::CHEMBL19342
SMILES OC1(Cc2ccc(F)cc2)CCN(CC#Cc2ccc3[nH]c(=O)sc3c2)CC1
InChI Key InChIKey=HFNHAUYGBNSUGI-UHFFFAOYSA-N
Data  1 IC50
  Tab Delimited (TSV)   2D SDfile   Computed 3D by Vconf -m prep SDfile
Find this compound or compounds like it in BindingDB:
Activity Spreadsheet -- Enzyme Inhibition Constant Data from BindingDB
Found 1 hit for monomerid = 50140335
TargetGlutamate receptor ionotropic, NMDA 1/2B(Rattus norvegicus (Rat))
Pfizer
Curated by ChEMBL
LigandPNGBDBM50140335(6-{3-[4-(4-Fluoro-benzyl)-4-hydroxy-piperidin-1-yl...)
Affinity DataIC50:  24nM. Assay description: Binding affinity against NR1A/2B receptor in rat brains by [3H]-ifenprodil displacement.
In DepthDetails ArticlePubMed