BDBM50140952 CHEMBL3754483
SMILES Cc1nc2c(Br)c(Br)c(Br)c(Br)c2n1CCC#N
InChI Key InChIKey=RKSIYIFBACVYDR-UHFFFAOYSA-N
Data  1 KI
  Tab Delimited (TSV)   2D SDfile   Computed 3D by Vconf -m prep SDfile
Find this compound or compounds like it in BindingDB:
Activity Spreadsheet -- Enzyme Inhibition Constant Data from BindingDB
Found 1 hit for monomerid = 50140952
TargetCasein kinase II subunit alpha(Homo sapiens (Human))
Warsaw University Of Technology
Curated by ChEMBL
LigandPNGBDBM50140952(CHEMBL3754483)
Affinity DataKi:  5.03E+3nM. Assay description: Inhibition of recombinant human CK2alpha using RRRDDDSDDD substrate peptide by scintillation counter in presence of [32P]ATP
In DepthDetails ArticlePubMed