BDBM50141040 CHEMBL3753068
SMILES Brc1c(Br)c(Br)c2n(CCCCC#N)cnc2c1Br
InChI Key InChIKey=AWFBKKHNWFZHRY-UHFFFAOYSA-N
Data  1 KI
  Tab Delimited (TSV)   2D SDfile   Computed 3D by Vconf -m prep SDfile
Find this compound or compounds like it in BindingDB:
Activity Spreadsheet -- Enzyme Inhibition Constant Data from BindingDB
Found 1 hit for monomerid = 50141040
TargetCasein kinase II subunit alpha(Homo sapiens (Human))
Warsaw University Of Technology
Curated by ChEMBL
LigandPNGBDBM50141040(CHEMBL3753068)
Affinity DataKi:  2.51E+3nM. Assay description: Inhibition of recombinant human CK2alpha using RRRDDDSDDD substrate peptide by scintillation counter in presence of [32P]ATP
In DepthDetails ArticlePubMed