BDBM50141122 (S)-2-[4-(1-Carboxy-3-methyl-butylcarbamoyl)-2-phenoxy-benzoylamino]-4-methyl-pentanoic acid::CHEMBL27963
SMILES CC(C)CC(NC(=O)c1ccc(C(=O)N[C@@H](CC(C)C)C(O)=O)c(Oc2ccccc2)c1)C(O)=O
InChI Key InChIKey=VQPPLCCRWVWYKW-LBAQZLPGSA-N
Data  1 KI
  Tab Delimited (TSV)   2D SDfile   Computed 3D by Vconf -m prep SDfile
Find this compound or compounds like it in BindingDB:
Activity Spreadsheet -- Enzyme Inhibition Constant Data from BindingDB
Found 1 hit for monomerid = 50141122
TargetBcl-2-like protein 1(Homo sapiens (Human))
Yale University
Curated by ChEMBL
LigandPNGBDBM50141122((S)-2-[4-(1-Carboxy-3-methyl-butylcarbamoyl)-2-phe...)
Affinity DataKi: >3.00E+4nM. Assay description: Binding affinity for Bcl-xL was assessed by a fluorescence polarizationassay using a fluorescently labeled 16-mer Bak-peptide
In DepthDetails ArticlePubMed