BDBM50141847 CHEMBL170717::Cyclohexyl-[3-{4-[5-(2,4-dichloro-phenyl)-2H-pyrazol-3-yl]-piperidin-1-ylmethyl}-4-(3-fluoro-phenyl)-pyrrolidin-1-yl]-acetic acid
SMILES OC(=O)[C@@H](C1CCCCC1)N1C[C@H](CN2CCC(CC2)c2cc(n[nH]2)-c2ccc(Cl)cc2Cl)[C@H](C1)c1cccc(F)c1
InChI Key InChIKey=AXEFQHJHLHVSPB-RZBJZMOUSA-N
Data  1 IC50
  Tab Delimited (TSV)   2D SDfile   Computed 3D by Vconf -m prep SDfile
Find this compound or compounds like it in BindingDB:
Activity Spreadsheet -- Enzyme Inhibition Constant Data from BindingDB
Found 1 hit for monomerid = 50141847
TargetC-C chemokine receptor type 5(Homo sapiens (Human))
Merck Research Laboratories
Curated by ChEMBL
LigandPNGBDBM50141847(CHEMBL170717 | Cyclohexyl-[3-{4-[5-(2,4-dichloro-p...)
Affinity DataIC50:  9nM. Assay description: Inhibition of human CX3C chemokine receptor 5 from GP120-membrane-based assay
In DepthDetails ArticlePubMed