BDBM50142211 CHEMBL7637::N-[4-(3-Methoxy-benzenesulfonyl)-phenyl]-butyramide
SMILES CCCC(=O)Nc1ccc(cc1)S(=O)(=O)c1cccc(OC)c1
InChI Key InChIKey=DZCMTJYCNYEEMI-UHFFFAOYSA-N
Data  2 KI
  Tab Delimited (TSV)   2D SDfile   Computed 3D by Vconf -m prep SDfile
Find this compound or compounds like it in BindingDB:
Activity Spreadsheet -- Enzyme Inhibition Constant Data from BindingDB
Found 2 hits for monomerid = 50142211
TargetMelatonin receptor type 1B(Homo sapiens (Human))
Bristol-Myers Squibb Pharmaceutical Research Institute
Curated by ChEMBL
LigandPNGBDBM50142211(CHEMBL7637 | N-[4-(3-Methoxy-benzenesulfonyl)-phen...)
Affinity DataKi:  10nM. Assay description: Binding affinity towards human melatonin receptor type 1B
In DepthDetails ArticlePubMed
TargetMelatonin receptor type 1A(Homo sapiens (Human))
Bristol-Myers Squibb Pharmaceutical Research Institute
Curated by ChEMBL
LigandPNGBDBM50142211(CHEMBL7637 | N-[4-(3-Methoxy-benzenesulfonyl)-phen...)
Affinity DataKi: >500nM. Assay description: Binding affinity towards human melatonin receptor type 1A
In DepthDetails ArticlePubMed