BDBM50142213 (E)-But-2-enoic acid [4-(3-methoxy-phenoxy)-phenyl]-amide::CHEMBL7559
SMILES COc1cccc(Oc2ccc(NC(=O)\C=C\C)cc2)c1
InChI Key InChIKey=GUAIOEMHQXMMII-HWKANZROSA-N
Data  2 KI
  Tab Delimited (TSV)   2D SDfile   Computed 3D by Vconf -m prep SDfile
Find this compound or compounds like it in BindingDB:
Activity Spreadsheet -- Enzyme Inhibition Constant Data from BindingDB
Found 2 hits for monomerid = 50142213
TargetMelatonin receptor type 1B(Homo sapiens (Human))
Bristol-Myers Squibb Pharmaceutical Research Institute
Curated by ChEMBL
LigandPNGBDBM50142213((E)-But-2-enoic acid [4-(3-methoxy-phenoxy)-phenyl...)
Affinity DataKi:  2.10nM. Assay description: Binding affinity towards human melatonin receptor type 1B
In DepthDetails ArticlePubMed
TargetMelatonin receptor type 1A(Homo sapiens (Human))
Bristol-Myers Squibb Pharmaceutical Research Institute
Curated by ChEMBL
LigandPNGBDBM50142213((E)-But-2-enoic acid [4-(3-methoxy-phenoxy)-phenyl...)
Affinity DataKi:  98nM. Assay description: Binding affinity towards human melatonin receptor type 1A
In DepthDetails ArticlePubMed