BDBM50142231 CHEMBL7867::N-[4-(3-Methoxy-benzyl)-phenyl]-butyramide
SMILES CCCC(=O)Nc1ccc(Cc2cccc(OC)c2)cc1
InChI Key InChIKey=YAJCTPBNRCUYLP-UHFFFAOYSA-N
Data  2 KI
  Tab Delimited (TSV)   2D SDfile   Computed 3D by Vconf -m prep SDfile
Find this compound or compounds like it in BindingDB:
Activity Spreadsheet -- Enzyme Inhibition Constant Data from BindingDB
Found 2 hits for monomerid = 50142231
TargetMelatonin receptor type 1B(Homo sapiens (Human))
Bristol-Myers Squibb Pharmaceutical Research Institute
Curated by ChEMBL
LigandPNGBDBM50142231(CHEMBL7867 | N-[4-(3-Methoxy-benzyl)-phenyl]-butyr...)
Affinity DataKi:  0.120nM. Assay description: Binding affinity towards human melatonin receptor type 1B
In DepthDetails ArticlePubMed
TargetMelatonin receptor type 1A(Homo sapiens (Human))
Bristol-Myers Squibb Pharmaceutical Research Institute
Curated by ChEMBL
LigandPNGBDBM50142231(CHEMBL7867 | N-[4-(3-Methoxy-benzyl)-phenyl]-butyr...)
Affinity DataKi:  11nM. Assay description: Binding affinity towards human melatonin receptor type 1A
In DepthDetails ArticlePubMed