BDBM50144552 (R)-4-Oxo-1-(4-{2-[4-(3-phenyl-propyl)-phenyl]-acetyl}-piperazine-1-carbonyl)-3-piperidin-4-ylmethyl-azetidine-2-carboxylic acid::CHEMBL72520
SMILES OC(=O)[C@@H]1[C@@H](CC2CCNCC2)C(=O)N1C(=O)N1CCN(CC1)C(=O)Cc1ccc(CCCc2ccccc2)cc1
InChI Key InChIKey=PZPGGBJAZPANHC-PXJZQJOASA-N
Data  2 IC50
  Tab Delimited (TSV)   2D SDfile   Computed 3D by Vconf -m prep SDfile
Find this compound or compounds like it in BindingDB:
Activity Spreadsheet -- Enzyme Inhibition Constant Data from BindingDB
Found 2 hits for monomerid = 50144552
TargetTryptase beta-2/delta/gamma(Homo sapiens (Human))
The Bristol-Myers Squibb Pharmaceutical Research Institute
Curated by ChEMBL
LigandPNGBDBM50144552((R)-4-Oxo-1-(4-{2-[4-(3-phenyl-propyl)-phenyl]-ace...)
Affinity DataIC50:  9nM. Assay description: Inhibitory activity against human tryptase
In DepthDetails ArticlePubMed
TargetSerine protease 1(Bos taurus (bovine))
The Bristol-Myers Squibb Pharmaceutical Research Institute
Curated by ChEMBL
LigandPNGBDBM50144552((R)-4-Oxo-1-(4-{2-[4-(3-phenyl-propyl)-phenyl]-ace...)
Affinity DataIC50:  1.58E+3nM. Assay description: Inhibitory activity against bovine trypsin
In DepthDetails ArticlePubMed