BDBM50144553 (R)-4-Oxo-1-[4-(4-phenoxy-benzoyl)-piperazine-1-carbonyl]-3-piperidin-4-ylmethyl-azetidine-2-carboxylic acid::CHEMBL431557
SMILES OC(=O)[C@@H]1[C@@H](CC2CCNCC2)C(=O)N1C(=O)N1CCN(CC1)C(=O)c1ccc(Oc2ccccc2)cc1
InChI Key InChIKey=AUYOZPJOPWTGLF-RPWUZVMVSA-N
Data  2 IC50
  Tab Delimited (TSV)   2D SDfile   Computed 3D by Vconf -m prep SDfile
Find this compound or compounds like it in BindingDB:
Activity Spreadsheet -- Enzyme Inhibition Constant Data from BindingDB
Found 2 hits for monomerid = 50144553
TargetTryptase beta-2/delta/gamma(Homo sapiens (Human))
The Bristol-Myers Squibb Pharmaceutical Research Institute
Curated by ChEMBL
LigandPNGBDBM50144553((R)-4-Oxo-1-[4-(4-phenoxy-benzoyl)-piperazine-1-ca...)
Affinity DataIC50:  7nM. Assay description: Inhibitory activity against human tryptase
In DepthDetails ArticlePubMed
TargetSerine protease 1(Bos taurus (bovine))
The Bristol-Myers Squibb Pharmaceutical Research Institute
Curated by ChEMBL
LigandPNGBDBM50144553((R)-4-Oxo-1-[4-(4-phenoxy-benzoyl)-piperazine-1-ca...)
Affinity DataIC50:  140nM. Assay description: Inhibitory activity against bovine trypsin
In DepthDetails ArticlePubMed