BDBM50144567 (R)-4-Oxo-3-piperidin-4-ylmethyl-1-[4-(3-m-tolyl-propionyl)-piperazine-1-carbonyl]-azetidine-2-carboxylic acid::CHEMBL429029
SMILES Cc1cccc(CCC(=O)N2CCN(CC2)C(=O)N2[C@@H]([C@@H](CC3CCNCC3)C2=O)C(O)=O)c1
InChI Key InChIKey=OSOVTHSUTDEIKI-IRLDBZIGSA-N
Data  2 IC50
  Tab Delimited (TSV)   2D SDfile   Computed 3D by Vconf -m prep SDfile
Find this compound or compounds like it in BindingDB:
Activity Spreadsheet -- Enzyme Inhibition Constant Data from BindingDB
Found 2 hits for monomerid = 50144567
TargetTryptase beta-2/delta/gamma(Homo sapiens (Human))
The Bristol-Myers Squibb Pharmaceutical Research Institute
Curated by ChEMBL
LigandPNGBDBM50144567((R)-4-Oxo-3-piperidin-4-ylmethyl-1-[4-(3-m-tolyl-p...)
Affinity DataIC50:  13nM. Assay description: Inhibitory activity against human tryptase
In DepthDetails ArticlePubMed
TargetSerine protease 1(Bos taurus (bovine))
The Bristol-Myers Squibb Pharmaceutical Research Institute
Curated by ChEMBL
LigandPNGBDBM50144567((R)-4-Oxo-3-piperidin-4-ylmethyl-1-[4-(3-m-tolyl-p...)
Affinity DataIC50:  1.20E+3nM. Assay description: Inhibitory activity against bovine trypsin
In DepthDetails ArticlePubMed