BDBM50144577 (R)-1-[4-(6-Naphthalen-1-yl-hexanoyl)-piperazine-1-carbonyl]-4-oxo-3-piperidin-4-ylmethyl-azetidine-2-carboxylic acid::CHEMBL72532
SMILES OC(=O)[C@@H]1[C@@H](CC2CCNCC2)C(=O)N1C(=O)N1CCN(CC1)C(=O)CCCCCc1cccc2ccccc12
InChI Key InChIKey=FXPVOGVCAKWEON-IAPPQJPRSA-N
Data  2 IC50
  Tab Delimited (TSV)   2D SDfile   Computed 3D by Vconf -m prep SDfile
Find this compound or compounds like it in BindingDB:
Activity Spreadsheet -- Enzyme Inhibition Constant Data from BindingDB
Found 2 hits for monomerid = 50144577
TargetTryptase beta-2/delta/gamma(Homo sapiens (Human))
The Bristol-Myers Squibb Pharmaceutical Research Institute
Curated by ChEMBL
LigandPNGBDBM50144577((R)-1-[4-(6-Naphthalen-1-yl-hexanoyl)-piperazine-1...)
Affinity DataIC50:  1nM. Assay description: Inhibitory activity against human tryptase
In DepthDetails ArticlePubMed
TargetSerine protease 1(Bos taurus (bovine))
The Bristol-Myers Squibb Pharmaceutical Research Institute
Curated by ChEMBL
LigandPNGBDBM50144577((R)-1-[4-(6-Naphthalen-1-yl-hexanoyl)-piperazine-1...)
Affinity DataIC50:  240nM. Assay description: Inhibitory activity against bovine trypsin
In DepthDetails ArticlePubMed