BDBM50144589 CHEMBL3759848
SMILES COc1cc2c(Nc3ccc(NC(=O)c4cccc(Cl)c4)cc3)ncnc2cc1OCCN1CCCCC1
InChI Key InChIKey=IBYFQHBVYWWLLA-UHFFFAOYSA-N
Data  2 IC50
  Tab Delimited (TSV)   2D SDfile   Computed 3D by Vconf -m prep SDfile
Find this compound or compounds like it in BindingDB:
Activity Spreadsheet -- Enzyme Inhibition Constant Data from BindingDB
Found 2 hits for monomerid = 50144589
TargetVascular endothelial growth factor receptor 2(Homo sapiens (Human))
China Pharmaceutical University
Curated by ChEMBL
LigandPNGBDBM50144589(CHEMBL3759848)
Affinity DataIC50:  1.99E+3nM. Assay description: Inhibition of human VEGFR-2 preincubated for 10 mins followed by addition of FAM-labeled peptide and incubated for 10 mins by Caliper motility shift ...
In DepthDetails ArticlePubMed
TargetEpidermal growth factor receptor(Homo sapiens (Human))
China Pharmaceutical University
Curated by ChEMBL
LigandPNGBDBM50144589(CHEMBL3759848)
Affinity DataIC50:  300nM. Assay description: Inhibition of human EGFR preincubated for 10 mins followed by addition of FAM-labeled peptide and incubated for 10 mins by Caliper motility shift ass...
In DepthDetails ArticlePubMed