BDBM50145016 1-Cyclohexyl-4-[3-(1,2,3,4-tetrahydro-naphthalen-1-yl)-propyl]-piperazine::CHEMBL75608
SMILES C(CC1CCCc2ccccc12)CN1CCN(CC1)C1CCCCC1
InChI Key InChIKey=YKRPIOCDRMZEBF-UHFFFAOYSA-N
Data  2 KI
  Tab Delimited (TSV)   2D SDfile   Computed 3D by Vconf -m prep SDfile
Find this compound or compounds like it in BindingDB:
Activity Spreadsheet -- Enzyme Inhibition Constant Data from BindingDB
Found 2 hits for monomerid = 50145016
TargetSigma non-opioid intracellular receptor 1(Homo sapiens (Human))
Università
Curated by ChEMBL
LigandPNGBDBM50145016(1-Cyclohexyl-4-[3-(1,2,3,4-tetrahydro-naphthalen-1...)
Affinity DataKi:  0.610nM. Assay description: In vitro binding afinity at opioid sigma-1 receptorin guinea pig brain membranes by (+)-[3H]-pentazocine displacement.
In DepthDetails ArticlePubMed
Target5-hydroxytryptamine receptor 3A/3B(Rattus norvegicus)
Università
Curated by ChEMBL
LigandPNGBDBM50145016(1-Cyclohexyl-4-[3-(1,2,3,4-tetrahydro-naphthalen-1...)
Affinity DataKi: >700nM. Assay description: In vitro binding affinity at serotonin 5-hydroxytryptamine 3 receptor in rat cortex by [3H]-granisetron displacement.
In DepthDetails ArticlePubMed