BDBM50145025 1-Cyclohexyl-4-[3-(7-methoxy-1,2,3,4-tetrahydro-naphthalen-1-yl)-propyl]-piperazine::CHEMBL75444
SMILES COc1ccc2CCCC(CCCN3CCN(CC3)C3CCCCC3)c2c1
InChI Key InChIKey=TUMKKQCFMIMRJN-UHFFFAOYSA-N
Data  3 KI
  Tab Delimited (TSV)   2D SDfile   Computed 3D by Vconf -m prep SDfile
Find this compound or compounds like it in BindingDB:
Activity Spreadsheet -- Enzyme Inhibition Constant Data from BindingDB
Found 3 hits for monomerid = 50145025
TargetSigma non-opioid intracellular receptor 1(Homo sapiens (Human))
Università
Curated by ChEMBL
LigandPNGBDBM50145025(1-Cyclohexyl-4-[3-(7-methoxy-1,2,3,4-tetrahydro-na...)
Affinity DataKi:  9.04nM. Assay description: In vitro binding afinity at opioid sigma-1 receptorin guinea pig brain membranes by (+)-[3H]-pentazocine displacement.
In DepthDetails ArticlePubMed
TargetD(2) dopamine receptor(Rattus norvegicus (rat))
Università
Curated by ChEMBL
LigandPNGBDBM50145025(1-Cyclohexyl-4-[3-(7-methoxy-1,2,3,4-tetrahydro-na...)
Affinity DataKi:  479nM. Assay description: In vitro binding affinity at Dopamine receptor D2 in rat striatum by [3H]-spiroperidol displacement.
In DepthDetails ArticlePubMed
Target5-hydroxytryptamine receptor 3A/3B(Rattus norvegicus)
Università
Curated by ChEMBL
LigandPNGBDBM50145025(1-Cyclohexyl-4-[3-(7-methoxy-1,2,3,4-tetrahydro-na...)
Affinity DataKi: >700nM. Assay description: In vitro binding affinity at serotonin 5-hydroxytryptamine 3 receptor in rat cortex by [3H]-granisetron displacement.
In DepthDetails ArticlePubMed