BDBM50145684 (4,6-Dimethyl-pyrimidin-5-yl)-(4-methyl-4-{(S)-3-methyl-4-[(S)-1-(4-trifluoromethyl-phenyl)-butyl]-piperazin-1-yl}-piperidin-1-yl)-methanone::CHEMBL432170
SMILES CCC[C@H](N1CCN(C[C@@H]1C)C1(C)CCN(CC1)C(=O)c1c(C)ncnc1C)c1ccc(cc1)C(F)(F)F
InChI Key InChIKey=AKVBPIBFLBXBAR-CPJSRVTESA-N
Data  4 KI
  Tab Delimited (TSV)   2D SDfile   Computed 3D by Vconf -m prep SDfile
Find this compound or compounds like it in BindingDB:
Activity Spreadsheet -- Enzyme Inhibition Constant Data from BindingDB
Found 4 hits for monomerid = 50145684
TargetC-C chemokine receptor type 5(Homo sapiens (Human))
Schering-Plough Research Institute
Curated by ChEMBL
LigandPNGBDBM50145684((4,6-Dimethyl-pyrimidin-5-yl)-(4-methyl-4-{(S)-3-m...)
Affinity DataKi:  1.10nM. Assay description: Antagonistic activity of the compound against C-C chemokine receptor type 5
In DepthDetails ArticlePubMed
TargetMuscarinic acetylcholine receptor M2(Homo sapiens (Human))
Schering-Plough Research Institute
Curated by ChEMBL
LigandPNGBDBM50145684((4,6-Dimethyl-pyrimidin-5-yl)-(4-methyl-4-{(S)-3-m...)
Affinity DataKi:  4.76E+3nM. Assay description: Antagonistic activity of the compound against Muscarinic acetylcholine receptor M2
In DepthDetails ArticlePubMed
TargetMuscarinic acetylcholine receptor M3(Homo sapiens (Human))
Schering-Plough Research Institute
Curated by ChEMBL
LigandPNGBDBM50145684((4,6-Dimethyl-pyrimidin-5-yl)-(4-methyl-4-{(S)-3-m...)
Affinity DataKi: >5.30E+3nM. Assay description: Antagonistic activity of the compound against muscarinic M3 receptor
In DepthDetails ArticlePubMed
TargetMuscarinic acetylcholine receptor M1(Homo sapiens (Human))
Schering-Plough Research Institute
Curated by ChEMBL
LigandPNGBDBM50145684((4,6-Dimethyl-pyrimidin-5-yl)-(4-methyl-4-{(S)-3-m...)
Affinity DataKi:  6.08E+3nM. Assay description: Antagonistic activity of the compound against muscarinic M1 receptor
In DepthDetails ArticlePubMed