BDBM50146238 CHEMBL314554::Phosphoric acid mono-[(R)-3-[4-(1H-indol-2-yloxy)-phenyl]-2-((Z)-octadec-9-enoylamino)-propyl] ester
SMILES CCCCCCCC\C=C/CCCCCCCC(=O)N[C@@H](COP(O)(O)=O)Cc1ccc(Oc2cc3ccccc3[nH]2)cc1
InChI Key InChIKey=ZVNRWOLYWGGLNB-HWNQJZBBSA-N
Data  1 KI  2 IC50
  Tab Delimited (TSV)   2D SDfile   Computed 3D by Vconf -m prep SDfile
Find this compound or compounds like it in BindingDB:
Activity Spreadsheet -- Enzyme Inhibition Constant Data from BindingDB
Found 3 hits for monomerid = 50146238
TargetLysophosphatidic acid receptor 1(Homo sapiens (Human))
University Of Virginia
Curated by ChEMBL
LigandPNGBDBM50146238(CHEMBL314554 | Phosphoric acid mono-[(R)-3-[4-(1H-...)
Affinity DataKi:  73nM. Assay description: In vitro ability to antagonize LPA-evoked [35S]-GTP-gammaS binding to lysophosphatidic acid receptor 1 in HEK293T cell lines
In DepthDetails ArticlePubMed
TargetLysophosphatidic acid receptor 1(Homo sapiens (Human))
University Of Virginia
Curated by ChEMBL
LigandPNGBDBM50146238(CHEMBL314554 | Phosphoric acid mono-[(R)-3-[4-(1H-...)
Affinity DataIC50:  7.00E+3nM. Assay description: In vitro ability to antagonize LPA-evoked [35S]-GTP-gammaS binding to lysophosphatidic acid receptor 1 in HEK293T cell lines
In DepthDetails ArticlePubMed
TargetLysophosphatidic acid receptor 3(Homo sapiens (Human))
University Of Virginia
Curated by ChEMBL
LigandPNGBDBM50146238(CHEMBL314554 | Phosphoric acid mono-[(R)-3-[4-(1H-...)
Affinity DataIC50:  2.63E+3nM. Assay description: In vitro antagonism of LPA-evoked [35S]-GTP-gammaS binding to lysophosphatidic acid receptor 3 in HEK293T cell lines
In DepthDetails ArticlePubMed