BDBM50146708 (S)-(4,6-Dimethyl-pyrimidin-2-yloxy)-[(S)-1-(4-methoxy-benzyl)-2-oxo-5-m-tolyl-2,3,4,5-tetrahydro-1H-benzo[e][1,4]diazepin-5-yl]-acetic acid::CHEMBL317510
SMILES COc1ccc(CN2c3ccccc3[C@](NCC2=O)([C@H](Oc2nc(C)cc(C)n2)C(O)=O)c2cccc(C)c2)cc1
InChI Key InChIKey=DWRQMVBEIBBSTC-PPTMTGTBSA-N
Data  2 IC50
  Tab Delimited (TSV)   2D SDfile   Computed 3D by Vconf -m prep SDfile
Find this compound or compounds like it in BindingDB:
Activity Spreadsheet -- Enzyme Inhibition Constant Data from BindingDB
Found 2 hits for monomerid = 50146708
TargetEndothelin-1 receptor(Homo sapiens (Human))
Actelion Pharmaceuticals
Curated by ChEMBL
LigandPNGBDBM50146708((S)-(4,6-Dimethyl-pyrimidin-2-yloxy)-[(S)-1-(4-met...)
Affinity DataIC50:  6.30nM. Assay description: Antagonist activity towards human recombinant Endothelin A receptor expressed in chinese hamster ovary (CHO) cells determined using [125I]-ET-1 as ra...
In DepthDetails ArticlePubMed
TargetEndothelin receptor type B(Homo sapiens (Human))
Actelion Pharmaceuticals
Curated by ChEMBL
LigandPNGBDBM50146708((S)-(4,6-Dimethyl-pyrimidin-2-yloxy)-[(S)-1-(4-met...)
Affinity DataIC50:  50.7nM. Assay description: Antagonist activity towards human recombinant Endothelin B receptor expressed in chinese hamster ovary (CHO) cells determined using [125I]-ET-1 as ra...
In DepthDetails ArticlePubMed