BDBM50147597 CHEMBL3764276
SMILES O=c1ccc2ccc(OCCNC3CCN(Cc4ccccc4)CC3)cc2o1
InChI Key InChIKey=BOXHJLTYYUXRSS-UHFFFAOYSA-N
Data  3 IC50
  Tab Delimited (TSV)   2D SDfile   Computed 3D by Vconf -m prep SDfile
Find this compound or compounds like it in BindingDB:
Activity Spreadsheet -- Enzyme Inhibition Constant Data from BindingDB
Found 3 hits for monomerid = 50147597
TargetAmine oxidase [flavin-containing] B(Homo sapiens (Human))
China Pharmaceutical University
Curated by ChEMBL
LigandPNGBDBM50147597(CHEMBL3764276)
Affinity DataIC50:  8.39E+3nM. Assay description: Inhibition of human recombinant MAO-B using p-tyramine substrate after 15 mins by fluorimetric analysis
In DepthDetails ArticlePubMed
TargetAcetylcholinesterase(Electrophorus electricus (Electric eel))
China Pharmaceutical University
Curated by ChEMBL
LigandPNGBDBM50147597(CHEMBL3764276)
Affinity DataIC50:  4.42E+3nM. Assay description: Inhibition of electric eel AChE using acetylthiocholine iodide as substrate preincubated for 6 mins followed by substrate addition measured up to 180...
In DepthDetails ArticlePubMed
TargetCholinesterase(Equus caballus (Horse))
China Pharmaceutical University
Curated by ChEMBL
LigandPNGBDBM50147597(CHEMBL3764276)
Affinity DataIC50:  5.34E+3nM. Assay description: Inhibition of equine serum BuChE using S-butyrylthiocholine iodide as substrate preincubated for 6 mins followed by substrate addition measured up to...
In DepthDetails ArticlePubMed