BDBM50148067 5'-Methoxy-1H,1'H-[2,3']biindolylidene-3,2'-dione::CHEMBL111624
SMILES COc1ccc2[nH]c(O)c(C3=Nc4ccccc4C3=O)c2c1
InChI Key InChIKey=QMBBFTGBRHKNPS-UHFFFAOYSA-N
Data  2 IC50
  Tab Delimited (TSV)   2D SDfile   Computed 3D by Vconf -m prep SDfile
Find this compound or compounds like it in BindingDB:
Activity Spreadsheet -- Enzyme Inhibition Constant Data from BindingDB
Found 2 hits for monomerid = 50148067
TargetCyclin-dependent kinase 5 activator 1(Homo sapiens (Human))
Vanderbilt University School Of Medicine
Curated by ChEMBL
LigandPNGBDBM50148067(5'-Methoxy-1H,1'H-[2,3']biindolylidene-3,2'-dione ...)
Affinity DataIC50:  1.20E+3nM. Assay description: Inhibition of Cyclin-dependent kinase 5-p35nck5a
In DepthDetails ArticlePubMed
LigandPNGBDBM50148067(5'-Methoxy-1H,1'H-[2,3']biindolylidene-3,2'-dione ...)
Affinity DataIC50:  1.50E+3nM. Assay description: Inhibition of Cyclin-dependent kinase 1-cyclin B of M-phase Marthasterias glacialis oocytes
In DepthDetails ArticlePubMed