BDBM50148643 CHEMBL3770340::US9518026, Example 51::US9956214, Compound 1627
SMILES CCOc1ccc2cc(cnc2c1)-c1nn(C(C)CO)c(N)c1C(N)=O
InChI Key InChIKey=VINBTOORIXBXPF-UHFFFAOYSA-N
Data  5 IC50
  Tab Delimited (TSV)   2D SDfile   Computed 3D by Vconf -m prep SDfile
Find this compound or compounds like it in BindingDB:
Activity Spreadsheet -- Enzyme Inhibition Constant Data from BindingDB
Found 5 hits for monomerid = 50148643
TargetCalmodulin-domain protein kinase 1(Toxoplasma gondii)
University Of Washington
Curated by ChEMBL
LigandPNGBDBM50148643(CHEMBL3770340 | US9518026, Example 51 | US9956214,...)
Affinity DataIC50:  26nM. Assay description: Inhibition of Toxoplasma gondii CDPK1 assessed as ATP consumption using (Biotin-C6-PLARTLSVAGLPGKK) as substrate after 90 mins by luciferase reporter...
In DepthDetails ArticlePubMed
TargetCalmodulin-domain protein kinase 1(Toxoplasma gondii)
University Of Washington
Curated by ChEMBL
LigandPNGBDBM50148643(CHEMBL3770340 | US9518026, Example 51 | US9956214,...)
Affinity DataIC50:  80nM. Assay description: Inhibition of TgCDPK1 and CpCDPK1 was determined using a luminescent kinase assay which measures ATP depletion in the presence of the Syntide 2 pepti...
In DepthDetails US Patent
TargetCalcium-dependent protein kinase 1(Cryptosporidium parvum)
University of Washington Through Its Center For Commercialization
US Patent
LigandPNGBDBM50148643(CHEMBL3770340 | US9518026, Example 51 | US9956214,...)
Affinity DataIC50:  9nM. Assay description: Inhibition of TgCDPK1 and CpCDPK1 was determined using a luminescent kinase assay which measures ATP depletion in the presence of the Syntide 2 pepti...
In DepthDetails US Patent
TargetCalmodulin-domain protein kinase 1(Toxoplasma gondii)
University Of Washington
Curated by ChEMBL
LigandPNGBDBM50148643(CHEMBL3770340 | US9518026, Example 51 | US9956214,...)
Affinity DataIC50:  20nM. Assay description: Inhibition of TgCDPK1 and CpCDPK1 was determined using a luminescent kinase assay which measures ATP depletion in the presence of the Syntide 2 pepti...
In DepthDetails US Patent
TargetUncharacterized protein(Cryptosporidium parvum)
University of Washington Through Its Center For Commercialization
US Patent
LigandPNGBDBM50148643(CHEMBL3770340 | US9518026, Example 51 | US9956214,...)
Affinity DataIC50:  30nM. Assay description: Inhibition of TgCDPK1 and CpCDPK1 was determined using a luminescent kinase assay which measures ATP depletion in the presence of the Syntide 2 pepti...
In DepthDetails US Patent