BDBM50148812 4-(4-Dimethylamino-phenyl)-5H-pyridazino[4,3-b]indol-3-ylamine::CHEMBL326827
SMILES CN(C)c1ccc(cc1)-c1c(N)nnc2c3ccccc3[nH]c12
InChI Key InChIKey=MUAARCGPNTZRTI-UHFFFAOYSA-N
Data  1 IC50
  Tab Delimited (TSV)   2D SDfile   Computed 3D by Vconf -m prep SDfile
Find this compound or compounds like it in BindingDB:
Activity Spreadsheet -- Enzyme Inhibition Constant Data from BindingDB
Found 1 hit for monomerid = 50148812
TargetAmine oxidase [flavin-containing] A(Rattus norvegicus (rat))
Russian Academy Of Sciences
Curated by ChEMBL
LigandPNGBDBM50148812(4-(4-Dimethylamino-phenyl)-5H-pyridazino[4,3-b]ind...)
Affinity DataIC50:  7.94E+4nM. Assay description: Inhibition of Monoamine oxidase A from rat liver mitochondria
In DepthDetails ArticlePubMed