BDBM50148816 4-(2-Fluoro-phenyl)-5H-pyridazino[4,3-b]indol-3-ylamine::CHEMBL324087
SMILES Nc1nnc2c3ccccc3[nH]c2c1-c1ccccc1F
InChI Key InChIKey=SXOJZGYLLNWRNN-UHFFFAOYSA-N
Data  1 IC50
  Tab Delimited (TSV)   2D SDfile   Computed 3D by Vconf -m prep SDfile
Find this compound or compounds like it in BindingDB:
Activity Spreadsheet -- Enzyme Inhibition Constant Data from BindingDB
Found 1 hit for monomerid = 50148816
TargetAmine oxidase [flavin-containing] A(Rattus norvegicus (rat))
Russian Academy Of Sciences
Curated by ChEMBL
LigandPNGBDBM50148816(4-(2-Fluoro-phenyl)-5H-pyridazino[4,3-b]indol-3-yl...)
Affinity DataIC50:  6.31E+5nM. Assay description: Inhibition of Monoamine oxidase A from rat liver mitochondria
In DepthDetails ArticlePubMed