BDBM50149727 CHEMBL361420::{5-[3-(2-Hydroxy-1-phenyl-ethoxy)-4-phenethyloxy-benzylidene]-4-oxo-2-thioxo-thiazolidin-3-yl}-acetic acid
SMILES OCC(Oc1cc(\C=C2/SC(=S)N(CC(O)=O)C2=O)ccc1OCCc1ccccc1)c1ccccc1
InChI Key InChIKey=LIXVFUFBYFQXDV-XYGWBWBKSA-N
Data  1 IC50
  Tab Delimited (TSV)   2D SDfile   Computed 3D by Vconf -m prep SDfile
Find this compound or compounds like it in BindingDB:
Activity Spreadsheet -- Enzyme Inhibition Constant Data from BindingDB
Found 1 hit for monomerid = 50149727
TargetDolichyl-phosphate-mannose--protein mannosyltransferase 1(Candida albicans)
Celltech R&D
Curated by ChEMBL
LigandPNGBDBM50149727(CHEMBL361420 | {5-[3-(2-Hydroxy-1-phenyl-ethoxy)-4...)
Affinity DataIC50:  170nM. Assay description: In vitro inhibition of Candida albicans protein mannosyl transferase 1
In DepthDetails ArticlePubMed