BDBM50149740 CHEMBL369345::{5-[1-[3-Benzyloxy-4-((S)-2-phenyl-propoxy)-phenyl]-meth-(Z)-ylidene]-4-oxo-2-thioxo-thiazolidin-3-yl}-acetic acid
SMILES C[C@H](COc1ccc(\C=C2/SC(=S)N(CC(O)=O)C2=O)cc1OCc1ccccc1)c1ccccc1
InChI Key InChIKey=MFCHSBDIWCBMFE-MGKUZBKYSA-N
Data  1 IC50
  Tab Delimited (TSV)   2D SDfile   Computed 3D by Vconf -m prep SDfile
Find this compound or compounds like it in BindingDB:
Activity Spreadsheet -- Enzyme Inhibition Constant Data from BindingDB
Found 1 hit for monomerid = 50149740
TargetDolichyl-phosphate-mannose--protein mannosyltransferase 1(Candida albicans)
Celltech R&D
Curated by ChEMBL
LigandPNGBDBM50149740(CHEMBL369345 | {5-[1-[3-Benzyloxy-4-((S)-2-phenyl-...)
Affinity DataIC50:  9.50E+3nM. Assay description: In vitro inhibition of Candida albicans protein mannosyl transferase 1
In DepthDetails ArticlePubMed