BDBM50149742 CHEMBL182584::{5-[1-[4-Benzyloxy-3-(4-trifluoromethoxy-benzyloxy)-phenyl]-meth-(E)-ylidene]-4-oxo-2-thioxo-thiazolidin-3-yl}-acetic acid
SMILES OC(=O)CN1C(=S)S\C(=C\c2ccc(OCc3ccccc3)c(OCc3ccc(OC(F)(F)F)cc3)c2)C1=O
InChI Key InChIKey=SNOCVPNPILKPFE-YDZHTSKRSA-N
Data  1 IC50
  Tab Delimited (TSV)   2D SDfile   Computed 3D by Vconf -m prep SDfile
Find this compound or compounds like it in BindingDB:
Activity Spreadsheet -- Enzyme Inhibition Constant Data from BindingDB
Found 1 hit for monomerid = 50149742
TargetDolichyl-phosphate-mannose--protein mannosyltransferase 1(Candida albicans)
Celltech R&D
Curated by ChEMBL
LigandPNGBDBM50149742(CHEMBL182584 | {5-[1-[4-Benzyloxy-3-(4-trifluorome...)
Affinity DataIC50:  2.00E+3nM. Assay description: In vitro inhibition of Candida albicans protein mannosyl transferase 1
In DepthDetails ArticlePubMed