BDBM50149748 CHEMBL363745::{5-[3-Benzyloxy-4-(4-chloro-benzyloxy)-benzylidene]-4-oxo-2-thioxo-thiazolidin-3-yl}-acetic acid
SMILES OC(=O)CN1C(=S)S\C(=C/c2ccc(OCc3ccc(Cl)cc3)c(OCc3ccccc3)c2)C1=O
InChI Key InChIKey=OWSLGYWEPUDVAT-QRVIBDJDSA-N
Data  1 IC50
  Tab Delimited (TSV)   2D SDfile   Computed 3D by Vconf -m prep SDfile
Find this compound or compounds like it in BindingDB:
Activity Spreadsheet -- Enzyme Inhibition Constant Data from BindingDB
Found 1 hit for monomerid = 50149748
TargetDolichyl-phosphate-mannose--protein mannosyltransferase 1(Candida albicans)
Celltech R&D
Curated by ChEMBL
LigandPNGBDBM50149748(CHEMBL363745 | {5-[3-Benzyloxy-4-(4-chloro-benzylo...)
Affinity DataIC50:  950nM. Assay description: In vitro inhibition of Candida albicans protein mannosyl transferase 1
In DepthDetails ArticlePubMed