BDBM50149765 CHEMBL433758::{5-[1-[3,4-Bis-(2,6-difluoro-benzyloxy)-phenyl]-meth-(Z)-ylidene]-4-oxo-2-thioxo-thiazolidin-3-yl}-acetic acid
SMILES OC(=O)CN1C(=S)S\C(=C/c2ccc(OCc3c(F)cccc3F)c(OCc3c(F)cccc3F)c2)C1=O
InChI Key InChIKey=OXCSUQKVWAVBKD-RMORIDSASA-N
Data  1 IC50
  Tab Delimited (TSV)   2D SDfile   Computed 3D by Vconf -m prep SDfile
Find this compound or compounds like it in BindingDB:
Activity Spreadsheet -- Enzyme Inhibition Constant Data from BindingDB
Found 1 hit for monomerid = 50149765
TargetDolichyl-phosphate-mannose--protein mannosyltransferase 1(Candida albicans)
Celltech R&D
Curated by ChEMBL
LigandPNGBDBM50149765(CHEMBL433758 | {5-[1-[3,4-Bis-(2,6-difluoro-benzyl...)
Affinity DataIC50:  2.00E+4nM. Assay description: In vitro inhibition of Candida albicans protein mannosyl transferase 1
In DepthDetails ArticlePubMed