BDBM50149772 CHEMBL182469::{5-[3-Benzyloxy-4-(2,4-difluoro-benzyloxy)-benzylidene]-4-oxo-2-thioxo-thiazolidin-3-yl}-acetic acid
SMILES OC(=O)CN1C(=S)S\C(=C/c2ccc(OCc3ccc(F)cc3F)c(OCc3ccccc3)c2)C1=O
InChI Key InChIKey=ZBURNDZUTYZCKH-KSEXSDGBSA-N
Data  1 IC50
  Tab Delimited (TSV)   2D SDfile   Computed 3D by Vconf -m prep SDfile
Find this compound or compounds like it in BindingDB:
Activity Spreadsheet -- Enzyme Inhibition Constant Data from BindingDB
Found 1 hit for monomerid = 50149772
TargetDolichyl-phosphate-mannose--protein mannosyltransferase 1(Candida albicans)
Celltech R&D
Curated by ChEMBL
LigandPNGBDBM50149772(CHEMBL182469 | {5-[3-Benzyloxy-4-(2,4-difluoro-ben...)
Affinity DataIC50:  6.50E+3nM. Assay description: In vitro inhibition of Candida albicans protein mannosyl transferase 1
In DepthDetails ArticlePubMed