BDBM50150226 3-(4-Bromo-2-fluoro-phenoxy)-2-(4-methanesulfonyl-phenyl)-6-methyl-pyran-4-one::3-(4-bromo-2-fluorophenoxy)-6-methyl-2-(4-(methylsulfonyl)phenyl)-4H-pyran-4-one::CHEMBL125460
SMILES Cc1cc(=O)c(Oc2ccc(Br)cc2F)c(o1)-c1ccc(cc1)S(C)(=O)=O
InChI Key InChIKey=SGZPDQDNNJQFNW-UHFFFAOYSA-N
Data  5 IC50
  Tab Delimited (TSV)   2D SDfile   Computed 3D by Vconf -m prep SDfile
Find this compound or compounds like it in BindingDB:
Activity Spreadsheet -- Enzyme Inhibition Constant Data from BindingDB
Found 5 hits for monomerid = 50150226
TargetProstaglandin G/H synthase 1(Homo sapiens (Human))
RhôNe-Poulenc Rorer
Curated by ChEMBL
LigandPNGBDBM50150226(3-(4-Bromo-2-fluoro-phenoxy)-2-(4-methanesulfonyl-...)
Affinity DataIC50:  2.28E+4nM. Assay description: Inhibition concentration against cyclooxygenase-1 (COX-1) in human whole blood
In DepthDetails ArticlePubMed
TargetProstaglandin G/H synthase 2(Homo sapiens (Human))
RhôNe-Poulenc Rorer
Curated by ChEMBL
LigandPNGBDBM50150226(3-(4-Bromo-2-fluoro-phenoxy)-2-(4-methanesulfonyl-...)
Affinity DataIC50:  150nM. Assay description: Inhibition concentration against cyclooxygenase-2 (COX-2) in human whole blood
In DepthDetails ArticlePubMed
TargetProstaglandin G/H synthase 1(Homo sapiens (Human))
RhôNe-Poulenc Rorer
Curated by ChEMBL
LigandPNGBDBM50150226(3-(4-Bromo-2-fluoro-phenoxy)-2-(4-methanesulfonyl-...)
Affinity DataIC50:  2.28E+4nM. Assay description: Inhibitory concentration for Cyclooxygenase-1 (Prostaglandin G/H synthase 1) in human whole blood
In DepthDetails ArticlePubMed
TargetProstaglandin G/H synthase 2(Homo sapiens (Human))
RhôNe-Poulenc Rorer
Curated by ChEMBL
LigandPNGBDBM50150226(3-(4-Bromo-2-fluoro-phenoxy)-2-(4-methanesulfonyl-...)
Affinity DataIC50:  150nM. Assay description: Inhibitory concentration for Cyclooxygenase-2 (Prostaglandin G/H synthase 2) in human whole blood
In DepthDetails ArticlePubMed
TargetProstaglandin G/H synthase 2(Homo sapiens (Human))
RhôNe-Poulenc Rorer
Curated by ChEMBL
LigandPNGBDBM50150226(3-(4-Bromo-2-fluoro-phenoxy)-2-(4-methanesulfonyl-...)
Affinity DataIC50:  150nM. Assay description: Inhibition of COX2 in human whole blood
In DepthDetails ArticlePubMed