BDBM50150301 CHEMBL182969::[7-(6-Morpholin-4-yl-pyridin-3-yl)-pteridin-4-yl]-(3-phenyl-propyl)-amine
SMILES C(CNc1ncnc2nc(cnc12)-c1ccc(nc1)N1CCOCC1)Cc1ccccc1
InChI Key InChIKey=ACYKCDNEHYDFTF-UHFFFAOYSA-N
Data  1 IC50
  Tab Delimited (TSV)   2D SDfile   Computed 3D by Vconf -m prep SDfile
Find this compound or compounds like it in BindingDB:
Activity Spreadsheet -- Enzyme Inhibition Constant Data from BindingDB
Found 1 hit for monomerid = 50150301
TargetAdenosine kinase(Homo sapiens (Human))
Abbott Laboratories
Curated by ChEMBL
LigandPNGBDBM50150301(CHEMBL182969 | [7-(6-Morpholin-4-yl-pyridin-3-yl)-...)
Affinity DataIC50:  72nM. Assay description: In vitro inhibitory concentration against Adenosine kinase in cycstolic assay
In DepthDetails ArticlePubMed