BDBM50150304 3-(3-Bromo-phenyl)-1-methyl-4-(6-morpholin-4-yl-pyridin-3-ylethynyl)-1H-pyrazolo[3,4-d]pyrimidine::CHEMBL181551
SMILES Cn1nc(-c2cccc(Br)c2)c2c(ncnc12)C#Cc1ccc(nc1)N1CCOCC1
InChI Key InChIKey=PNSBZTOXYBLUOV-UHFFFAOYSA-N
Data  1 IC50
  Tab Delimited (TSV)   2D SDfile   Computed 3D by Vconf -m prep SDfile
Find this compound or compounds like it in BindingDB:
Activity Spreadsheet -- Enzyme Inhibition Constant Data from BindingDB
Found 1 hit for monomerid = 50150304
TargetAdenosine kinase(Homo sapiens (Human))
Abbott Laboratories
Curated by ChEMBL
LigandPNGBDBM50150304(3-(3-Bromo-phenyl)-1-methyl-4-(6-morpholin-4-yl-py...)
Affinity DataIC50:  82nM. Assay description: In vitro inhibitory concentration against Adenosine kinase in cycstolic assay
In DepthDetails ArticlePubMed