BDBM50150309 1-Benzyl-3-(3-bromo-phenyl)-4-(6-morpholin-4-yl-pyridin-3-ylethynyl)-1H-pyrazolo[3,4-d]pyrimidine::CHEMBL363442
SMILES Brc1cccc(c1)-c1nn(Cc2ccccc2)c2ncnc(C#Cc3ccc(nc3)N3CCOCC3)c12
InChI Key InChIKey=QPJLCNMYKPQSKL-UHFFFAOYSA-N
Data  1 IC50
  Tab Delimited (TSV)   2D SDfile   Computed 3D by Vconf -m prep SDfile
Find this compound or compounds like it in BindingDB:
Activity Spreadsheet -- Enzyme Inhibition Constant Data from BindingDB
Found 1 hit for monomerid = 50150309
TargetAdenosine kinase(Homo sapiens (Human))
Abbott Laboratories
Curated by ChEMBL
LigandPNGBDBM50150309(1-Benzyl-3-(3-bromo-phenyl)-4-(6-morpholin-4-yl-py...)
Affinity DataIC50: >1.00E+3nM. Assay description: In vitro inhibitory concentration against Adenosine kinase in cycstolic assay
In DepthDetails ArticlePubMed