BDBM50150349 CHEMBL266407::Methanesulfonamide derivative
SMILES C[C@@H](CCC(O)=O)[C@@H]1CC[C@@H]2[C@H]3[C@@H](O)C[C@H]4C[C@@H](CC[C@@]4(C)[C@@H]3C[C@@H](O)[C@@]12C)OCCNC(=O)CCc1ccc(Oc2ccc(CN(Cc3ccccc3)c3cccc(NS(C)(=O)=O)c3C)cc2)cc1
InChI Key InChIKey=WJKLTGBFLMIJSC-ZASOAMQUSA-N
Data  3 IC50
  Tab Delimited (TSV)   2D SDfile   Computed 3D by Vconf -m prep SDfile
Find this compound or compounds like it in BindingDB:
Activity Spreadsheet -- Enzyme Inhibition Constant Data from BindingDB
Found 3 hits for monomerid = 50150349
TargetGlucocorticoid receptor(Homo sapiens (Human))
Abbott Laboratories
Curated by ChEMBL
LigandPNGBDBM50150349(CHEMBL266407 | Methanesulfonamide derivative)
Affinity DataIC50:  17nM. Assay description: Inhibition of [3H]dexamethasone binding to human glucocorticoid receptor
In DepthDetails ArticlePubMed
TargetSodium/bile acid cotransporter(Rattus norvegicus)
Abbott Laboratories
Curated by ChEMBL
LigandPNGBDBM50150349(CHEMBL266407 | Methanesulfonamide derivative)
Affinity DataIC50:  4nM. Assay description: Inhibition of [3H]taurocholate uptake in rat hepatocytes
In DepthDetails ArticlePubMed
TargetGlucocorticoid receptor(Homo sapiens (Human))
Abbott Laboratories
Curated by ChEMBL
LigandPNGBDBM50150349(CHEMBL266407 | Methanesulfonamide derivative)
Affinity DataIC50:  450nM. Assay description: Inhibition of glucocorticoid receptor Dexamethasone response in reporter gene assay
In DepthDetails ArticlePubMed