BDBM50150408 CHEMBL182937::N-[2-(4-Fluoro-phenoxy)-ethyl]-N''-[(S)-1-(4-fluoro-phenyl)-ethyl]-[1,3,5]triazine-2,4,6-triamine
SMILES C[C@H](Nc1nc(N)nc(NCCOc2ccc(F)cc2)n1)c1ccc(F)cc1
InChI Key InChIKey=UNUSDSJWMRJMCT-LBPRGKRZSA-N
Data  3 KI
  Tab Delimited (TSV)   2D SDfile   Computed 3D by Vconf -m prep SDfile
Find this compound or compounds like it in BindingDB:
Activity Spreadsheet -- Enzyme Inhibition Constant Data from BindingDB
Found 3 hits for monomerid = 50150408
Target5-hydroxytryptamine receptor 7(Homo sapiens (Human))
Bristol-Myers Squibb Pharmaceutical Research Institute
Curated by ChEMBL
LigandPNGBDBM50150408(CHEMBL182937 | N-[2-(4-Fluoro-phenoxy)-ethyl]-N''-...)
Affinity DataKi:  2nM. Assay description: Binding affinity against 5-Hydroxy tryptamine 7 receptor
In DepthDetails ArticlePubMed
Target5-hydroxytryptamine receptor 2C(Homo sapiens (Human))
Bristol-Myers Squibb Pharmaceutical Research Institute
Curated by ChEMBL
LigandPNGBDBM50150408(CHEMBL182937 | N-[2-(4-Fluoro-phenoxy)-ethyl]-N''-...)
Affinity DataKi: >1.00E+3nM. Assay description: Binding affinity against 5-Hydroxy tryptamine 2C receptor
In DepthDetails ArticlePubMed
Target5-hydroxytryptamine receptor 6(Homo sapiens (Human))
Bristol-Myers Squibb Pharmaceutical Research Institute
Curated by ChEMBL
LigandPNGBDBM50150408(CHEMBL182937 | N-[2-(4-Fluoro-phenoxy)-ethyl]-N''-...)
Affinity DataKi: >1.00E+3nM. Assay description: Binding affinity against 5-Hydroxy tryptamine 6 receptor
In DepthDetails ArticlePubMed