BDBM50150446 CHEMBL181356::N*2*-(2-Phenoxy-ethyl)-N*4*-((S)-1-phenyl-ethyl)-pyridine-2,4-diamine
SMILES C[C@H](Nc1ccnc(NCCOc2ccccc2)c1)c1ccccc1
InChI Key InChIKey=IAPJFOZYPZBZBV-KRWDZBQOSA-N
Data  1 KI
  Tab Delimited (TSV)   2D SDfile   Computed 3D by Vconf -m prep SDfile
Find this compound or compounds like it in BindingDB:
Activity Spreadsheet -- Enzyme Inhibition Constant Data from BindingDB
Found 1 hit for monomerid = 50150446
Target5-hydroxytryptamine receptor 7(Homo sapiens (Human))
Bristol-Myers Squibb Pharmaceutical Research Institute
Curated by ChEMBL
LigandPNGBDBM50150446(CHEMBL181356 | N*2*-(2-Phenoxy-ethyl)-N*4*-((S)-1-...)
Affinity DataKi:  0.400nM. Assay description: Binding affinity against 5-Hydroxy tryptamine 7 receptor
In DepthDetails ArticlePubMed