BDBM50150624 CHEMBL3770697
SMILES OB(O)c1ccc(CC(=O)NCCCCCCCc2ccccc2)cc1
InChI Key InChIKey=KCSNVRSPWWDSSE-UHFFFAOYSA-N
Data  2 IC50  1 EC50
  Tab Delimited (TSV)   2D SDfile   Computed 3D by Vconf -m prep SDfile
Find this compound or compounds like it in BindingDB:
Activity Spreadsheet -- Enzyme Inhibition Constant Data from BindingDB
Found 3 hits for monomerid = 50150624
TargetTransient receptor potential cation channel subfamily V member 1(Homo sapiens (Human))
Sapienza University Of Rome
Curated by ChEMBL
LigandPNGBDBM50150624(CHEMBL3770697)
Affinity DataEC50:  370nM. Assay description: Agonist activity at recombinant human TRPV1 channel expressed in HEK293 cells assessed as increase in intracellular Ca2+ concentration by Fluo-4-AM d...
In DepthDetails ArticlePubMed
TargetTransient receptor potential cation channel subfamily V member 1(Homo sapiens (Human))
Sapienza University Of Rome
Curated by ChEMBL
LigandPNGBDBM50150624(CHEMBL3770697)
Affinity DataIC50:  370nM. Assay description: Antagonist activity at recombinant human TRPV1 channel expressed in HEK293 cells assessed as inhibition of capsiacin-induced Ca2+ flux preincubated f...
In DepthDetails ArticlePubMed
TargetFatty-acid amide hydrolase 1 [30-579](Rattus norvegicus (rat))
Sapienza University Of Rome
Curated by ChEMBL
LigandPNGBDBM50150624(CHEMBL3770697)
Affinity DataIC50:  250nM. Assay description: Inhibition of rat brain FAAH assessed as hydrolysis of [14C]AEA to [14C]Ethanolamine incubated for 30 mins by scintillation counting method
In DepthDetails ArticlePubMed